Reaction Details
TargetAcetylcholinesterase
LigandBDBM8961
Substrate/Competitorn/a
Meas. Tech.ChEMBL_855524 (CHEMBL2162680)
IC50 64.57±n/a nM
Citation Wang, YWang, FYu, JPJiang, FCGuan, XLWang, CMLi, LCao, HLi, MXChen, JG Novel multipotent phenylthiazole-tacrine hybrids for the inhibition of cholinesterase activity,ß-amyloid aggregation and Ca²¿ overload. Bioorg Med Chem20:6513-22 (2012) 
 
Acetylcholinesterase
Name:Acetylcholinesterase
Type:Enzyme
Mol. Mass.:71812.79
Organism:Electrophorus electricus (Electric eel)
Description:n/a
Residue:633
BDBM8961
NameBDBM8961
Synonyms:1,2,3,4-tetrahydro-9-acridinamine 9-THA CHEMBL1337960 Cognex Tracine cid_1935 | tacrine.HCl
TypeSmall organic molecule
Emp. Form.C13H14N2
Mol. Mass.198.2637
SMILESNc1c2CCCCc2nc2ccccc12