Reaction Details
TargetTyrosine-protein phosphatase non-receptor type 1
LigandBDBM50394207
Substrate/Competitorn/a
Meas. Tech.ChEMBL_856703 (CHEMBL2162374)
IC50 4600±n/a nM
Citation Nguyen, PHSharma, GDao, TTUddin, MNKang, KWNdinteh, DTMbafor, JTOh, WK New prenylated isoflavonoids as protein tyrosine phosphatase 1B (PTP1B) inhibitors from Erythrina addisoniae. Bioorg Med Chem20:6459-64 (2012) 
 
Tyrosine-protein phosphatase non-receptor type 1
Name:Tyrosine-protein phosphatase non-receptor type 1
Type:Protein phosphatase
Mol. Mass.:49963.76
Organism:Homo sapiens (Human)
Description:Human recombinant GST-fusion PTP1B (1-435).
Residue:435
BDBM50394207
NameBDBM50394207
Synonyms:CHEMBL2159047
TypeSmall organic molecule
Emp. Form.C21H22O5
Mol. Mass.354.3964
SMILES[#6]-[#8]-c1ccc(cc1-[#6]\[#6]=[#6](\[#6])-[#6])-[#6@H]-1-[#6]-[#8]-c2cc(-[#8])cc(-[#8])c2-[#6]-1=O