Reaction Details
TargetPeroxisome proliferator-activated receptor gamma
LigandBDBM50394344
Substrate/Competitorn/a
Meas. Tech.ChEMBL_857112 (CHEMBL2162786)
EC50>50000±n/a nM
Citation Quang, THNgan, NTMinh, CVKiem, PVYen, PHTai, BHNhiem, NXThao, NPAnh, Hle TLuyen, BTYang, SYChoi, CWKim, YH Diarylheptanoid glycosides from Tacca plantaginea and their effects on NF-¿B activation and PPAR transcriptional activity. Bioorg Med Chem Lett22:6681-7 (2012) 
 
Peroxisome proliferator-activated receptor gamma
Name:Peroxisome proliferator-activated receptor gamma
Type:Nuclear Receptor
Mol. Mass.:57613.46
Organism:Homo sapiens (Human)
Description:P37231
Residue:505
BDBM50394344
NameBDBM50394344
Synonyms:CHEMBL2159607
TypeSmall organic molecule
Emp. Form.C25H32O11
Mol. Mass.508.515
SMILESOC[C@H]1O[C@@H](O[C@@H]2C[C@H](CCc3ccc(O)c(O)c3)O[C@@H](C2)c2ccc(O)c(O)c2)[C@H](O)[C@@H](O)[C@@H]1O