Reaction Details
TargetPeroxisome proliferator-activated receptor alpha
LigandBDBM50371235
Substrate/Competitorn/a
Meas. Tech.ChEMBL_857111 (CHEMBL2162785)
EC50 900±n/a nM
Citation Quang, THNgan, NTMinh, CVKiem, PVYen, PHTai, BHNhiem, NXThao, NPAnh, Hle TLuyen, BTYang, SYChoi, CWKim, YH Diarylheptanoid glycosides from Tacca plantaginea and their effects on NF-¿B activation and PPAR transcriptional activity. Bioorg Med Chem Lett22:6681-7 (2012) 
 
Peroxisome proliferator-activated receptor alpha
Name:Peroxisome proliferator-activated receptor alpha
Type:Enzyme
Mol. Mass.:52222.08
Organism:Homo sapiens (Human)
Description:Q07869
Residue:468
BDBM50371235
NameBDBM50371235
Synonyms:CIPROFIBRATE
TypeSmall organic molecule
Emp. Form.C13H14Cl2O3
Mol. Mass.289.154
SMILESCC(C)(Oc1ccc(cc1)C1CC1(Cl)Cl)C(O)=O