Reaction Details
TargetPeroxisome proliferator-activated receptor alpha
LigandBDBM50394346
Substrate/Competitorn/a
Meas. Tech.ChEMBL_857111 (CHEMBL2162785)
EC50 47100±n/a nM
Citation Quang, THNgan, NTMinh, CVKiem, PVYen, PHTai, BHNhiem, NXThao, NPAnh, Hle TLuyen, BTYang, SYChoi, CWKim, YH Diarylheptanoid glycosides from Tacca plantaginea and their effects on NF-¿B activation and PPAR transcriptional activity. Bioorg Med Chem Lett22:6681-7 (2012) 
 
Peroxisome proliferator-activated receptor alpha
Name:Peroxisome proliferator-activated receptor alpha
Type:Enzyme
Mol. Mass.:52222.08
Organism:Homo sapiens (Human)
Description:Q07869
Residue:468
BDBM50394346
NameBDBM50394346
Synonyms:CHEMBL2159605
TypeSmall organic molecule
Emp. Form.C31H42O15
Mol. Mass.654.6562
SMILESOC[C@H]1O[C@@H](Oc2ccc(CCCCC(=O)CCc3ccc(O[C@@H]4O[C@H](CO)[C@@H](O)[C@H](O)[C@H]4O)c(O)c3)cc2O)[C@H](O)[C@@H](O)[C@@H]1O