Reaction Details
TargetPlatelet glycoprotein 4
LigandBDBM50395006
Substrate/Competitorn/a
Meas. Tech.ChEMBL_858884 (CHEMBL2167930)
IC50>10000±n/a nM
Citation Proulx, CPicard, ÉBoeglin, DPohankova, PChemtob, SOng, HLubell, WD Azapeptide analogues of the growth hormone releasing peptide 6 as cluster of differentiation 36 receptor ligands with reduced affinity for the growth hormone secretagogue receptor 1a. J Med Chem55:6502-11 (2012) 
 
Platelet glycoprotein 4
Name:Platelet glycoprotein 4
Type:PROTEIN
Mol. Mass.:52740.95
Organism:Rattus norvegicus
Description:ChEMBL_858884
Residue:472
BDBM50395006
NameBDBM50395006
Synonyms:CHEMBL2163473
TypeSmall organic molecule
Emp. Form.C47H56N12O6
Mol. Mass.885.0243
SMILESC[C@H](NC(=O)N(Cc1cccc2ccccc12)NC(=O)C(N)Cc1cnc[nH]1)C(=O)N[C@@H](Cc1c[nH]c2ccccc12)C(=O)N[C@H](Cc1ccccc1)C(=O)N[C@@H](CCCCN)C(N)=O