Reaction Details
TargetPlatelet glycoprotein 4
LigandBDBM50394982
Substrate/Competitorn/a
Meas. Tech.ChEMBL_858884 (CHEMBL2167930)
IC50 9010±n/a nM
Citation Proulx, CPicard, ÉBoeglin, DPohankova, PChemtob, SOng, HLubell, WD Azapeptide analogues of the growth hormone releasing peptide 6 as cluster of differentiation 36 receptor ligands with reduced affinity for the growth hormone secretagogue receptor 1a. J Med Chem55:6502-11 (2012) 
 
Platelet glycoprotein 4
Name:Platelet glycoprotein 4
Type:PROTEIN
Mol. Mass.:52740.95
Organism:Rattus norvegicus
Description:ChEMBL_858884
Residue:472
BDBM50394982
NameBDBM50394982
Synonyms:CHEMBL2163467
TypeSmall organic molecule
Emp. Form.C42H49N11O5
Mol. Mass.787.9092
SMILESCC(C)CN(NC(=O)[C@@H](Cc1c[nH]c2ccccc12)NC(=O)[C@@H](N)Cc1cnc[nH]1)C(=O)N[C@@H](Cc1c[nH]c2ccccc12)C(=O)N[C@H](Cc1ccccc1)C(N)=O