Reaction Details
TargetPlatelet glycoprotein 4
LigandBDBM50394986
Substrate/Competitorn/a
Meas. Tech.ChEMBL_858884 (CHEMBL2167930)
IC50>10000±n/a nM
Citation Proulx, CPicard, ÉBoeglin, DPohankova, PChemtob, SOng, HLubell, WD Azapeptide analogues of the growth hormone releasing peptide 6 as cluster of differentiation 36 receptor ligands with reduced affinity for the growth hormone secretagogue receptor 1a. J Med Chem55:6502-11 (2012) 
 
Platelet glycoprotein 4
Name:Platelet glycoprotein 4
Type:PROTEIN
Mol. Mass.:52740.95
Organism:Rattus norvegicus
Description:ChEMBL_858884
Residue:472
BDBM50394986
NameBDBM50394986
Synonyms:CHEMBL2163463
TypeSmall organic molecule
Emp. Form.C45H58N10O6
Mol. Mass.835.0054
SMILESCCC(=O)N[C@H](Cc1c[nH]c2ccccc12)C(=O)NN(CC(C)C)C(=O)N[C@@H](Cc1c[nH]c2ccccc12)C(=O)N[C@H](Cc1ccccc1)C(=O)N[C@@H](CCCCN)C(N)=O