Reaction Details
TargetPlatelet glycoprotein 4
LigandBDBM50395016
Substrate/Competitorn/a
Meas. Tech.ChEMBL_858884 (CHEMBL2167930)
IC50 9480±n/a nM
Citation Proulx, CPicard, ÉBoeglin, DPohankova, PChemtob, SOng, HLubell, WD Azapeptide analogues of the growth hormone releasing peptide 6 as cluster of differentiation 36 receptor ligands with reduced affinity for the growth hormone secretagogue receptor 1a. J Med Chem55:6502-11 (2012) 
 
Platelet glycoprotein 4
Name:Platelet glycoprotein 4
Type:PROTEIN
Mol. Mass.:52740.95
Organism:Rattus norvegicus
Description:ChEMBL_858884
Residue:472
BDBM50395016
NameBDBM50395016
Synonyms:CHEMBL2163452 | US9708370, CP-2B(ii)
TypeSmall organic molecule
Emp. Form.C42H57N13O6
Mol. Mass.839.9855
SMILESCC(C)CN(NC(=O)[C@@H](Cc1c[nH]c2ccccc12)NC(=O)[C@@H](N)Cc1cnc[nH]1)C(=O)N[C@@H](Cc1c[nH]c2ccccc12)C(=O)N[C@H](C)C(=O)N[C@@H](CCCCN)C(N)=O