Reaction Details
Target5'-nucleotidase
LigandBDBM50395095
Substrate/Competitorn/a
Meas. Tech.ChEMBL_859457 (CHEMBL2167535)
IC50 7100±n/a nM
Citation Ripphausen, PFreundlieb, MBrunschweiger, AZimmermann, HMüller, CEBajorath, J Virtual screening identifies novel sulfonamide inhibitors of ecto-5'-nucleotidase. J Med Chem55:6576-81 (2012) 
 
5'-nucleotidase
Name:5'-nucleotidase
Type:Enzyme
Mol. Mass.:63971.44
Organism:Rattus norvegicus (Rat)
Description:P21588
Residue:576
BDBM50395095
NameBDBM50395095
Synonyms:CHEMBL2164294
TypeSmall organic molecule
Emp. Form.C28H22N4O4S3
Mol. Mass.574.694
SMILESO=C(NC(=S)Nc1ccc(cc1)S(=O)(=O)c1ccc(NC(=S)NC(=O)c2ccccc2)cc1)c1ccccc1