Reaction Details
TargetMetabotropic glutamate receptor 5
LigandBDBM50395937
Substrate/Competitorn/a
Meas. Tech.ChEMBL_858305 (CHEMBL2168304)
IC50 24±n/a nM
Citation Raboisson, PBreitholtz-Emanuelsson, ADahllöf, HEdwards, LHeaton, WLIsaac, MJarvie, KKers, AMinidis, ABNordmark, ASheehan, SMSlassi, AStröm, PTerelius, YWensbo, DWilson, JMXin, TMcLeod, DA Discovery and characterization of AZD9272 and AZD6538-Two novel mGluR5 negative allosteric modulators selected for clinical development. Bioorg Med Chem Lett22:6974-9 (2012) 
 
Metabotropic glutamate receptor 5
Name:Metabotropic glutamate receptor 5
Type:Enzyme
Mol. Mass.:131900.14
Organism:Rattus norvegicus (Rat)
Description:P31424
Residue:1203
BDBM50395937
NameBDBM50395937
Synonyms:CHEMBL2164538
TypeSmall organic molecule
Emp. Form.C9H8N2S
Mol. Mass.176.238
SMILESCc1nc(cs1)-c1cccnc1