Reaction Details
TargetMetabotropic glutamate receptor 5
LigandBDBM50395941
Substrate/Competitorn/a
Meas. Tech.ChEMBL_858087 (CHEMBL2166999)
IC50 23±n/a nM
Citation Raboisson, PBreitholtz-Emanuelsson, ADahllöf, HEdwards, LHeaton, WLIsaac, MJarvie, KKers, AMinidis, ABNordmark, ASheehan, SMSlassi, AStröm, PTerelius, YWensbo, DWilson, JMXin, TMcLeod, DA Discovery and characterization of AZD9272 and AZD6538-Two novel mGluR5 negative allosteric modulators selected for clinical development. Bioorg Med Chem Lett22:6974-9 (2012) 
 
Metabotropic glutamate receptor 5
Name:Metabotropic glutamate receptor 5
Type:Enzyme
Mol. Mass.:132484.72
Organism:Homo sapiens (Human)
Description:n/a
Residue:1212
BDBM50395941
NameBDBM50395941
Synonyms:CHEMBL2164546
TypeSmall organic molecule
Emp. Form.C14H7FN4O
Mol. Mass.266.23
SMILESFc1cc(cc(c1)-c1noc(n1)-c1ccccn1)C#N