Reaction Details
Target2-Hydroxyacid oxidase 2
LigandBDBM50396207
Substrate/Competitorn/a
Meas. Tech.ChEMBL_863190 (CHEMBL2175914)
IC50 400±n/a nM
Citation Barawkar, DABandyopadhyay, ADeshpande, AKoul, SKandalkar, SPatil, PKhose, GVyas, SMone, MBhosale, SSingh, UDe, SMeru, AGundu, JChugh, APalle, VPMookhtiar, KAVacca, JPChakravarty, PKNargund, RPWright, SDRoy, SGraziano, MPCully, DCai, TQSingh, SB Discovery of pyrazole carboxylic acids as potent inhibitors of rat long chain L-2-hydroxy acid oxidase. Bioorg Med Chem Lett22:4341-7 (2012) 
 
2-Hydroxyacid oxidase 2
Name:2-Hydroxyacid oxidase 2
Type:PROTEIN
Mol. Mass.:39204.34
Organism:Rattus norvegicus
Description:ChEMBL_863190
Residue:353
BDBM50396207
NameBDBM50396207
Synonyms:CHEMBL2172034
TypeSmall organic molecule
Emp. Form.C19H15F3N2O2
Mol. Mass.360.3298
SMILESCc1[nH]nc(C(O)=O)c1Cc1cccc(c1)-c1ccc(cc1)C(F)(F)F