Reaction Details
Target2-Hydroxyacid oxidase 2
LigandBDBM50396216
Substrate/Competitorn/a
Meas. Tech.ChEMBL_863190 (CHEMBL2175914)
IC50 1300±n/a nM
Citation Barawkar, DABandyopadhyay, ADeshpande, AKoul, SKandalkar, SPatil, PKhose, GVyas, SMone, MBhosale, SSingh, UDe, SMeru, AGundu, JChugh, APalle, VPMookhtiar, KAVacca, JPChakravarty, PKNargund, RPWright, SDRoy, SGraziano, MPCully, DCai, TQSingh, SB Discovery of pyrazole carboxylic acids as potent inhibitors of rat long chain L-2-hydroxy acid oxidase. Bioorg Med Chem Lett22:4341-7 (2012) 
 
2-Hydroxyacid oxidase 2
Name:2-Hydroxyacid oxidase 2
Type:PROTEIN
Mol. Mass.:39204.34
Organism:Rattus norvegicus
Description:ChEMBL_863190
Residue:353
BDBM50396216
NameBDBM50396216
Synonyms:CHEMBL2172170
TypeSmall organic molecule
Emp. Form.C13H11F3N2O2
Mol. Mass.284.2338
SMILESCc1[nH]nc(C(O)=O)c1Cc1ccccc1C(F)(F)F