Reaction Details
Target2-Hydroxyacid oxidase 2
LigandBDBM50382410
Substrate/Competitorn/a
Meas. Tech.ChEMBL_863190 (CHEMBL2175914)
IC50 910±n/a nM
Citation Barawkar, DABandyopadhyay, ADeshpande, AKoul, SKandalkar, SPatil, PKhose, GVyas, SMone, MBhosale, SSingh, UDe, SMeru, AGundu, JChugh, APalle, VPMookhtiar, KAVacca, JPChakravarty, PKNargund, RPWright, SDRoy, SGraziano, MPCully, DCai, TQSingh, SB Discovery of pyrazole carboxylic acids as potent inhibitors of rat long chain L-2-hydroxy acid oxidase. Bioorg Med Chem Lett22:4341-7 (2012) 
 
2-Hydroxyacid oxidase 2
Name:2-Hydroxyacid oxidase 2
Type:PROTEIN
Mol. Mass.:39204.34
Organism:Rattus norvegicus
Description:ChEMBL_863190
Residue:353
BDBM50382410
NameBDBM50382410
Synonyms:CHEMBL2022568
TypeSmall organic molecule
Emp. Form.C19H18N2O2
Mol. Mass.306.3584
SMILESCc1[nH]nc(C(O)=O)c1CCc1ccc(cc1)-c1ccccc1