Reaction Details
TargetMitogen-activated protein kinase kinase kinase kinase 2
LigandBDBM50396243
Substrate/Competitorn/a
Meas. Tech.ChEMBL_863859 (CHEMBL2176249)
Kd 11±n/a nM
Citation Lewis, RTBode, CMChoquette, DMPotashman, MRomero, KStellwagen, JCTeffera, YMoore, EWhittington, DAChen, HEpstein, LFEmkey, RAndrews, PSYu, VLSaffran, DCXu, MDrew, AMerkel, PSzilvassy, SBrake, RL The discovery and optimization of a novel class of potent, selective, and orally bioavailable anaplastic lymphoma kinase (ALK) inhibitors with potential utility for the treatment of cancer. J Med Chem55:6523-40 (2012) 
 
Mitogen-activated protein kinase kinase kinase kinase 2
Name:Mitogen-activated protein kinase kinase kinase kinase 2
Type:n/a
Mol. Mass.:91551.35
Organism:Homo sapiens (Human)
Description:n/a
Residue:820
BDBM50396243
NameBDBM50396243
Synonyms:CHEMBL2172308 | US10370379, Compound TSR-011
TypeSmall organic molecule
Emp. Form.C33H44FN5O3
Mol. Mass.577.7326
SMILESCC(C)NC(=O)[C@H]1CC[C@H](CC1)n1c(NC(=O)c2ccc(F)cc2)nc2ccc(CN3CCC(CC3)C(C)(C)O)cc12