Reaction Details
TargetLeukocyte tyrosine kinase receptor
LigandBDBM50396243
Substrate/Competitorn/a
Meas. Tech.ChEMBL_863861 (CHEMBL2176251)
Kd 2.5±n/a nM
Citation Lewis, RTBode, CMChoquette, DMPotashman, MRomero, KStellwagen, JCTeffera, YMoore, EWhittington, DAChen, HEpstein, LFEmkey, RAndrews, PSYu, VLSaffran, DCXu, MDrew, AMerkel, PSzilvassy, SBrake, RL The discovery and optimization of a novel class of potent, selective, and orally bioavailable anaplastic lymphoma kinase (ALK) inhibitors with potential utility for the treatment of cancer. J Med Chem55:6523-40 (2012) 
 
Leukocyte tyrosine kinase receptor
Name:Leukocyte tyrosine kinase receptor
Type:PROTEIN
Mol. Mass.:91679.76
Organism:Homo sapiens (Human)
Description:ChEMBL_586334
Residue:864
BDBM50396243
NameBDBM50396243
Synonyms:CHEMBL2172308 | US10370379, Compound TSR-011
TypeSmall organic molecule
Emp. Form.C33H44FN5O3
Mol. Mass.577.7326
SMILESCC(C)NC(=O)[C@H]1CC[C@H](CC1)n1c(NC(=O)c2ccc(F)cc2)nc2ccc(CN3CCC(CC3)C(C)(C)O)cc12