Reaction Details
TargetEukaryotic translation initiation factor 2-alpha kinase 3
LigandBDBM50396528
Substrate/Competitorn/a
Meas. Tech.ChEMBL_862854 (CHEMBL2172956)
IC50 3.2±n/a nM
Citation Axten, JMMedina, JRFeng, YShu, ARomeril, SPGrant, SWLi, WHHeerding, DAMinthorn, EMencken, TAtkins, CLiu, QRabindran, SKumar, RHong, XGoetz, AStanley, TTaylor, JDSigethy, SDTomberlin, GHHassell, AMKahler, KMShewchuk, LMGampe, RT Discovery of 7-methyl-5-(1-{[3-(trifluoromethyl)phenyl]acetyl}-2,3-dihydro-1H-indol-5-yl)-7H-pyrrolo[2,3-d]pyrimidin-4-amine (GSK2606414), a potent and selective first-in-class inhibitor of protein kinase R (PKR)-like endoplasmic reticulum kinase (PERK). J Med Chem55:7193-207 (2012) 
 
Eukaryotic translation initiation factor 2-alpha kinase 3
Name:Eukaryotic translation initiation factor 2-alpha kinase 3
Type:Enzyme
Mol. Mass.:125190.66
Organism:Homo sapiens (Human)
Description:Q9NZJ5
Residue:1116
BDBM50396528
NameBDBM50396528
Synonyms:CHEMBL2171128
TypeSmall organic molecule
Emp. Form.C28H22N4OS
Mol. Mass.462.565
SMILESNc1ncc(-c2cccnc2)c2scc(-c3ccc4N(CCc4c3)C(=O)Cc3ccccc3)c12