Reaction Details
TargetPhosphatidylinositol 4,5-bisphosphate 3-kinase catalytic subunit delta isoform
LigandBDBM50396613
Substrate/Competitorn/a
Meas. Tech.ChEMBL_864100 (CHEMBL2174948)
Ki 80±n/a nM
Citation Gonzalez-Lopez de Turiso, FShin, YBrown, MCardozo, MChen, YFong, DHao, XHe, XHenne, KHu, YLJohnson, MGKohn, TLohman, JMcBride, HJMcGee, LRMedina, JCMetz, DMiner, KMohn, DPattaropong, VSeganish, JSimard, JLWannberg, SWhittington, DAYu, GCushing, TD Discovery and in vivo evaluation of dual PI3Kß/d inhibitors. J Med Chem55:7667-85 (2012) 
 
Phosphatidylinositol 4,5-bisphosphate 3-kinase catalytic subunit delta isoform
Name:Phosphatidylinositol 4,5-bisphosphate 3-kinase catalytic subunit delta isoform
Type:Enzyme Subunit
Mol. Mass.:119489.41
Organism:Homo sapiens (Human)
Description:O00329
Residue:1044
BDBM50396613
NameBDBM50396613
Synonyms:CHEMBL2171924 | US8765940, 1-(7-fluoro-3-methyl-2-(2-pyridinyl)-4-quinolinyl)-6-(4-morpholinyl)-1,2-dihydrospiro[indole-3,3'-thietane] 1',1'-dioxide
TypeSmall organic molecule
Emp. Form.C29H27FN4O3S
Mol. Mass.530.613
SMILESCc1c(nc2cc(F)ccc2c1N1CC2(CS(=O)(=O)C2)c2ccc(cc12)N1CCOCC1)-c1ccccn1