Reaction Details
TargetPhosphatidylinositol 4,5-bisphosphate 3-kinase catalytic subunit gamma isoform
LigandBDBM50396614
Substrate/Competitorn/a
Meas. Tech.ChEMBL_864101 (CHEMBL2174949)
Ki 509±n/a nM
Citation Gonzalez-Lopez de Turiso, FShin, YBrown, MCardozo, MChen, YFong, DHao, XHe, XHenne, KHu, YLJohnson, MGKohn, TLohman, JMcBride, HJMcGee, LRMedina, JCMetz, DMiner, KMohn, DPattaropong, VSeganish, JSimard, JLWannberg, SWhittington, DAYu, GCushing, TD Discovery and in vivo evaluation of dual PI3Kß/d inhibitors. J Med Chem55:7667-85 (2012) 
 
Phosphatidylinositol 4,5-bisphosphate 3-kinase catalytic subunit gamma isoform
Name:Phosphatidylinositol 4,5-bisphosphate 3-kinase catalytic subunit gamma isoform
Type:Enzyme Subunit
Mol. Mass.:126470.30
Organism:Homo sapiens (Human)
Description:P48736
Residue:1102
BDBM50396614
NameBDBM50396614
Synonyms:CHEMBL2171931 | US8765940, 1'-(7-fluoro-3-methyl-2-(2-pyridinyl)-4-quinolinyl)-6-(4-morpholinyl)-1,2,2,3,5,6-hexahydrospiro[pyran-4,3-pyrrolo[3,2-b]pyridine]
TypeSmall organic molecule
Emp. Form.C30H30FN5O2
Mol. Mass.511.5899
SMILESCc1c(nc2cc(F)ccc2c1N1CC2(CCOCC2)c2ncc(cc12)N1CCOCC1)-c1ccccn1