Reaction Details
TargetPhosphatidylinositol 4,5-bisphosphate 3-kinase catalytic subunit delta isoform
LigandBDBM50396617
Substrate/Competitorn/a
Meas. Tech.ChEMBL_864100 (CHEMBL2174948)
Ki 154±n/a nM
Citation Gonzalez-Lopez de Turiso, FShin, YBrown, MCardozo, MChen, YFong, DHao, XHe, XHenne, KHu, YLJohnson, MGKohn, TLohman, JMcBride, HJMcGee, LRMedina, JCMetz, DMiner, KMohn, DPattaropong, VSeganish, JSimard, JLWannberg, SWhittington, DAYu, GCushing, TD Discovery and in vivo evaluation of dual PI3Kß/d inhibitors. J Med Chem55:7667-85 (2012) 
 
Phosphatidylinositol 4,5-bisphosphate 3-kinase catalytic subunit delta isoform
Name:Phosphatidylinositol 4,5-bisphosphate 3-kinase catalytic subunit delta isoform
Type:Enzyme Subunit
Mol. Mass.:119489.41
Organism:Homo sapiens (Human)
Description:O00329
Residue:1044
BDBM50396617
NameBDBM50396617
Synonyms:CHEMBL2171925 | US8765940, (1-(7-fluoro-3-methyl-2-(2-pyridinyl)-4-quinolinyl)-6-(4-morpholinyl)-2,3-dihydro-1H-indole-3,3-diyl)dimethanol
TypeSmall organic molecule
Emp. Form.C29H29FN4O3
Mol. Mass.500.564
SMILESCc1c(nc2cc(F)ccc2c1N1CC(CO)(CO)c2ccc(cc12)N1CCOCC1)-c1ccccn1