Reaction Details
TargetPhosphatidylinositol 4,5-bisphosphate 3-kinase catalytic subunit delta isoform
LigandBDBM50396611
Substrate/Competitorn/a
Meas. Tech.ChEMBL_864100 (CHEMBL2174948)
Ki 10±n/a nM
Citation Gonzalez-Lopez de Turiso, FShin, YBrown, MCardozo, MChen, YFong, DHao, XHe, XHenne, KHu, YLJohnson, MGKohn, TLohman, JMcBride, HJMcGee, LRMedina, JCMetz, DMiner, KMohn, DPattaropong, VSeganish, JSimard, JLWannberg, SWhittington, DAYu, GCushing, TD Discovery and in vivo evaluation of dual PI3Kß/d inhibitors. J Med Chem55:7667-85 (2012) 
 
Phosphatidylinositol 4,5-bisphosphate 3-kinase catalytic subunit delta isoform
Name:Phosphatidylinositol 4,5-bisphosphate 3-kinase catalytic subunit delta isoform
Type:Enzyme Subunit
Mol. Mass.:119489.41
Organism:Homo sapiens (Human)
Description:O00329
Residue:1044
BDBM50396611
NameBDBM50396611
Synonyms:CHEMBL2171927 | US8765940, 4-(1-(7-fluoro-3-methyl-2-(2-pyridinyl)-4-quinolinyl)-3,3-dimethyl-2,3-dihydro-1H-indol-6-yl)-2-pyrimidinamine
TypeSmall organic molecule
Emp. Form.C29H25FN6
Mol. Mass.476.5474
SMILESCc1c(nc2cc(F)ccc2c1N1CC(C)(C)c2ccc(cc12)-c1ccnc(N)n1)-c1ccccn1