Reaction Details
TargetSodium/glucose cotransporter 1
LigandBDBM20880
Substrate/Competitorn/a
Meas. Tech.ChEMBL_864703 (CHEMBL2174861)
IC50 800±n/a nM
Citation Ohtake, YSato, TKobayashi, TNishimoto, MTaka, NTakano, KYamamoto, KOhmori, MYamaguchi, MTakami, KYeu, SYAhn, KHMatsuoka, HMorikawa, KSuzuki, MHagita, HOzawa, KYamaguchi, KKato, MIkeda, S Discovery of tofogliflozin, a novel C-arylglucoside with an O-spiroketal ring system, as a highly selective sodium glucose cotransporter 2 (SGLT2) inhibitor for the treatment of type 2 diabetes. J Med Chem55:7828-40 (2012) 
 
Sodium/glucose cotransporter 1
Name:Sodium/glucose cotransporter 1
Type:Protein
Mol. Mass.:73503.78
Organism:Homo sapiens (Human)
Description:P13866
Residue:664
BDBM20880
NameBDBM20880
Synonyms:(2S,3R,4R,5S,6R)-2-{4-chloro-3-[(4-ethoxyphenyl)methyl]phenyl}-6-(hydroxymethyl)oxane-3,4,5-triol C-aryl glucoside, 6 Dapagliflozin
TypeSmall organic molecule
Emp. Form.C21H25ClO6
Mol. Mass.408.873
SMILESCCOc1ccc(Cc2cc(ccc2Cl)[C@@H]2O[C@H](CO)[C@@H](O)[C@H](O)[C@H]2O)cc1