Reaction Details
TargetSodium/glucose cotransporter 2
LigandBDBM20875
Substrate/Competitorn/a
Meas. Tech.ChEMBL_864704 (CHEMBL2174862)
IC50 16.4±n/a nM
Citation Ohtake, YSato, TKobayashi, TNishimoto, MTaka, NTakano, KYamamoto, KOhmori, MYamaguchi, MTakami, KYeu, SYAhn, KHMatsuoka, HMorikawa, KSuzuki, MHagita, HOzawa, KYamaguchi, KKato, MIkeda, S Discovery of tofogliflozin, a novel C-arylglucoside with an O-spiroketal ring system, as a highly selective sodium glucose cotransporter 2 (SGLT2) inhibitor for the treatment of type 2 diabetes. J Med Chem55:7828-40 (2012) 
 
Sodium/glucose cotransporter 2
Name:Sodium/glucose cotransporter 2
Type:Protein
Mol. Mass.:72902.00
Organism:Homo sapiens (Human)
Description:P31639
Residue:672
BDBM20875
NameBDBM20875
Synonyms:1-(2,4-dihydroxy-6-{[(2S,3R,4S,5S,6R)-3,4,5-trihydroxy-6-(hydroxymethyl)oxan-2-yl]oxy}phenyl)-3-(4-hydroxyphenyl)propan-1-one CHEMBL245067 O-glucoside, 1 | Phlorizin
TypeNatural product
Emp. Form.C21H24O10
Mol. Mass.436.4093
SMILESOC[C@H]1O[C@@H](Oc2cc(O)cc(O)c2C(=O)CCc2ccc(O)cc2)[C@H](O)[C@@H](O)[C@@H]1O