Reaction Details
TargetCarbonic anhydrase 12
LigandBDBM50112446
Substrate/Competitorn/a
Meas. Tech.ChEMBL_861926 (CHEMBL2173730)
IC50 5440±n/a nM
Citation Reich, RHoffman, AVeerendhar, AMaresca, AInnocenti, ASupuran, CTBreuer, E Carbamoylphosphonates control tumor cell proliferation and dissemination by simultaneously inhibiting carbonic anhydrase IX and matrix metalloproteinase-2. Toward nontoxic chemotherapy targeting tumor microenvironment. J Med Chem55:7875-82 (2012) 
 
Carbonic anhydrase 12
Name:Carbonic anhydrase 12
Type:Enzyme
Mol. Mass.:39456.00
Organism:Homo sapiens (Human)
Description:Catalytic domain of human cloned isozyme was used in the assay
Residue:354
BDBM50112446
NameBDBM50112446
Synonyms:CHEMBL24447 | [(2-phenylethyl)amino]carbonylphosphonic acid
TypeSmall organic molecule
Emp. Form.C9H12NO4P
Mol. Mass.229.1696
SMILESOP(O)(=O)C(=O)NCCc1ccccc1