Reaction Details
TargetCarbonic anhydrase 2
LigandBDBM50396798
Substrate/Competitorn/a
Meas. Tech.ChEMBL_861927 (CHEMBL2173731)
IC50 9660±n/a nM
Citation Reich, RHoffman, AVeerendhar, AMaresca, AInnocenti, ASupuran, CTBreuer, E Carbamoylphosphonates control tumor cell proliferation and dissemination by simultaneously inhibiting carbonic anhydrase IX and matrix metalloproteinase-2. Toward nontoxic chemotherapy targeting tumor microenvironment. J Med Chem55:7875-82 (2012) 
 
Carbonic anhydrase 2
Name:Carbonic anhydrase 2
Type:Enzyme
Mol. Mass.:29250.71
Organism:Homo sapiens (Human)
Description:P00918
Residue:260
BDBM50396798
NameBDBM50396798
Synonyms:CHEMBL1801472
TypeSmall organic molecule
Emp. Form.C7H15N2O4P
Mol. Mass.222.1788
SMILESOP(O)(=O)C(=O)NCCN1CCCC1