Reaction Details
TargetCarbonic anhydrase 2
LigandBDBM50146808
Substrate/Competitorn/a
Meas. Tech.ChEMBL_861927 (CHEMBL2173731)
IC50 8790±n/a nM
Citation Reich, RHoffman, AVeerendhar, AMaresca, AInnocenti, ASupuran, CTBreuer, E Carbamoylphosphonates control tumor cell proliferation and dissemination by simultaneously inhibiting carbonic anhydrase IX and matrix metalloproteinase-2. Toward nontoxic chemotherapy targeting tumor microenvironment. J Med Chem55:7875-82 (2012) 
 
Carbonic anhydrase 2
Name:Carbonic anhydrase 2
Type:Enzyme
Mol. Mass.:29250.71
Organism:Homo sapiens (Human)
Description:P00918
Residue:260
BDBM50146808
NameBDBM50146808
Synonyms:CHEMBL318664 | [(1-ethylpropyl)amino]carbonylphosphonic acid
TypeSmall organic molecule
Emp. Form.C6H14NO4P
Mol. Mass.195.1534
SMILESCCC(CC)NC(=O)P(O)(O)=O