Reaction Details
TargetCarbonic anhydrase 1
LigandBDBM50396796
Substrate/Competitorn/a
Meas. Tech.ChEMBL_861928 (CHEMBL2173732)
IC50 1600±n/a nM
Citation Reich, RHoffman, AVeerendhar, AMaresca, AInnocenti, ASupuran, CTBreuer, E Carbamoylphosphonates control tumor cell proliferation and dissemination by simultaneously inhibiting carbonic anhydrase IX and matrix metalloproteinase-2. Toward nontoxic chemotherapy targeting tumor microenvironment. J Med Chem55:7875-82 (2012) 
 
Carbonic anhydrase 1
Name:Carbonic anhydrase 1
Type:Enzyme
Mol. Mass.:28873.37
Organism:Homo sapiens (Human)
Description:P00915
Residue:261
BDBM50396796
NameBDBM50396796
Synonyms:CHEMBL2172751
TypeSmall organic molecule
Emp. Form.C7H15N2O4P
Mol. Mass.222.1788
SMILESN[C@@H]1CCCC[C@@H]1NC(=O)P(O)(O)=O