Reaction Details
Target72 kDa type IV collagenase
LigandBDBM50396802
Substrate/Competitorn/a
Meas. Tech.ChEMBL_861930 (CHEMBL2173734)
IC50 200±n/a nM
Citation Reich, RHoffman, AVeerendhar, AMaresca, AInnocenti, ASupuran, CTBreuer, E Carbamoylphosphonates control tumor cell proliferation and dissemination by simultaneously inhibiting carbonic anhydrase IX and matrix metalloproteinase-2. Toward nontoxic chemotherapy targeting tumor microenvironment. J Med Chem55:7875-82 (2012) 
 
72 kDa type IV collagenase
Name:72 kDa type IV collagenase
Type:Enzyme
Mol. Mass.:73870.36
Organism:Homo sapiens (Human)
Description: P08253
Residue:660
BDBM50396802
NameBDBM50396802
Synonyms:CHEMBL2172747
TypeSmall organic molecule
Emp. Form.C9H18NO4P
Mol. Mass.235.2173
SMILESC[C@@H](NC(=O)P(O)(O)=O)C1CCCCC1