Reaction Details
Target72 kDa type IV collagenase
LigandBDBM50112446
Substrate/Competitorn/a
Meas. Tech.ChEMBL_861930 (CHEMBL2173734)
IC50 20000±n/a nM
Citation Reich, RHoffman, AVeerendhar, AMaresca, AInnocenti, ASupuran, CTBreuer, E Carbamoylphosphonates control tumor cell proliferation and dissemination by simultaneously inhibiting carbonic anhydrase IX and matrix metalloproteinase-2. Toward nontoxic chemotherapy targeting tumor microenvironment. J Med Chem55:7875-82 (2012) 
 
72 kDa type IV collagenase
Name:72 kDa type IV collagenase
Type:Enzyme
Mol. Mass.:73870.36
Organism:Homo sapiens (Human)
Description: P08253
Residue:660
BDBM50112446
NameBDBM50112446
Synonyms:CHEMBL24447 | [(2-phenylethyl)amino]carbonylphosphonic acid
TypeSmall organic molecule
Emp. Form.C9H12NO4P
Mol. Mass.229.1696
SMILESOP(O)(=O)C(=O)NCCc1ccccc1