Reaction Details
Target72 kDa type IV collagenase
LigandBDBM50146805
Substrate/Competitorn/a
Meas. Tech.ChEMBL_861930 (CHEMBL2173734)
IC50 200±n/a nM
Citation Reich, RHoffman, AVeerendhar, AMaresca, AInnocenti, ASupuran, CTBreuer, E Carbamoylphosphonates control tumor cell proliferation and dissemination by simultaneously inhibiting carbonic anhydrase IX and matrix metalloproteinase-2. Toward nontoxic chemotherapy targeting tumor microenvironment. J Med Chem55:7875-82 (2012) 
 
72 kDa type IV collagenase
Name:72 kDa type IV collagenase
Type:Enzyme
Mol. Mass.:73870.36
Organism:Homo sapiens (Human)
Description: P08253
Residue:660
BDBM50146805
NameBDBM50146805
Synonyms:CHEMBL97951 | [(cyclohexylmethyl)amino]carbonylphosphonic acid
TypeSmall organic molecule
Emp. Form.C8H16NO4P
Mol. Mass.221.1907
SMILESOP(O)(=O)C(=O)NCC1CCCCC1