Reaction Details
TargetMitogen-activated protein kinase 13
LigandBDBM50396845
Substrate/Competitorn/a
Meas. Tech.ChEMBL_862227 (CHEMBL2172908)
IC50 11±n/a nM
Citation Asano, TYamazaki, HKasahara, CKubota, HKontani, THarayama, YOhno, KMizuhara, HYokomoto, MMisumi, KKinoshita, TOhta, MTakeuchi, M Identification, synthesis, and biological evaluation of 6-[(6R)-2-(4-fluorophenyl)-6-(hydroxymethyl)-4,5,6,7-tetrahydropyrazolo[1,5-a]pyrimidin-3-yl]-2-(2-methylphenyl)pyridazin-3(2H)-one (AS1940477), a potent p38 MAP kinase inhibitor. J Med Chem55:7772-85 (2012) 
 
Mitogen-activated protein kinase 13
Name:Mitogen-activated protein kinase 13
Type:Enzyme
Mol. Mass.:42097.16
Organism:Homo sapiens (Human)
Description:O15264
Residue:365
BDBM50396845
NameBDBM50396845
Synonyms:CHEMBL2170294
TypeSmall organic molecule
Emp. Form.C24H22FN5O2
Mol. Mass.431.4622
SMILESCc1ccccc1-n1nc(ccc1=O)-c1c2NC[C@@H](CO)Cn2nc1-c1ccc(F)cc1