Reaction Details
TargetBromodomain-containing protein 3
LigandBDBM50397665
Substrate/Competitorn/a
Meas. Tech.ChEMBL_873615 (CHEMBL2187904)
IC50 630.96±n/a nM
Citation Seal, JLamotte, YDonche, FBouillot, AMirguet, OGellibert, FNicodeme, EKrysa, GKirilovsky, JBeinke, SMcCleary, SRioja, IBamborough, PChung, CWGordon, LLewis, TWalker, ALCutler, LLugo, DWilson, DMWitherington, JLee, KPrinjha, RK Identification of a novel series of BET family bromodomain inhibitors: binding mode and profile of I-BET151 (GSK1210151A). Bioorg Med Chem Lett22:2968-72 (2012) 
 
Bromodomain-containing protein 3
Name:Bromodomain-containing protein 3
Type:Protein
Mol. Mass.:79571.81
Organism:Homo sapiens (Human)
Description:Q15059
Residue:726
BDBM50397665
NameBDBM50397665
Synonyms:CHEMBL2017282
TypeSmall organic molecule
Emp. Form.C22H17FN4O3
Mol. Mass.404.3938
SMILESCOc1cc2c3n(-c4ccccc4F)c(=O)[nH]c3cnc2cc1-c1c(C)noc1C