Reaction Details
TargetBromodomain-containing protein 2
LigandBDBM50380680
Substrate/Competitorn/a
Meas. Tech.ChEMBL_873616 (CHEMBL2187905)
IC50 398.11±n/a nM
Citation Seal, JLamotte, YDonche, FBouillot, AMirguet, OGellibert, FNicodeme, EKrysa, GKirilovsky, JBeinke, SMcCleary, SRioja, IBamborough, PChung, CWGordon, LLewis, TWalker, ALCutler, LLugo, DWilson, DMWitherington, JLee, KPrinjha, RK Identification of a novel series of BET family bromodomain inhibitors: binding mode and profile of I-BET151 (GSK1210151A). Bioorg Med Chem Lett22:2968-72 (2012) 
 
Bromodomain-containing protein 2
Name:Bromodomain-containing protein 2
Type:Protein
Mol. Mass.:88085.95
Organism:Homo sapiens (Human)
Description:P25440
Residue:801
BDBM50380680
NameBDBM50380680
Synonyms:CHEMBL2017288
TypeSmall organic molecule
Emp. Form.C24H22N4O3
Mol. Mass.414.4565
SMILESCOc1cc2c3n([C@H](C)c4ccccc4)c(=O)[nH]c3cnc2cc1-c1c(C)noc1C