Reaction Details
TargetBromodomain-containing protein 2
LigandBDBM50380669
Substrate/Competitorn/a
Meas. Tech.ChEMBL_873616 (CHEMBL2187905)
IC50 501.19±n/a nM
Citation Seal, JLamotte, YDonche, FBouillot, AMirguet, OGellibert, FNicodeme, EKrysa, GKirilovsky, JBeinke, SMcCleary, SRioja, IBamborough, PChung, CWGordon, LLewis, TWalker, ALCutler, LLugo, DWilson, DMWitherington, JLee, KPrinjha, RK Identification of a novel series of BET family bromodomain inhibitors: binding mode and profile of I-BET151 (GSK1210151A). Bioorg Med Chem Lett22:2968-72 (2012) 
 
Bromodomain-containing protein 2
Name:Bromodomain-containing protein 2
Type:Protein
Mol. Mass.:88085.95
Organism:Homo sapiens (Human)
Description:P25440
Residue:801
BDBM50380669
NameBDBM50380669
Synonyms:CHEMBL2017273
TypeSmall organic molecule
Emp. Form.C22H19FN4O3
Mol. Mass.406.4097
SMILESCOc1cc2c(Nc3ccccc3F)c(cnc2cc1-c1c(C)noc1C)C(N)=O