Reaction Details
TargetCytochrome P450 3A4
LigandBDBM50380682
Substrate/Competitorn/a
Meas. Tech.ChEMBL_873607 (CHEMBL2187896)
IC50 9700±n/a nM
Citation Seal, JLamotte, YDonche, FBouillot, AMirguet, OGellibert, FNicodeme, EKrysa, GKirilovsky, JBeinke, SMcCleary, SRioja, IBamborough, PChung, CWGordon, LLewis, TWalker, ALCutler, LLugo, DWilson, DMWitherington, JLee, KPrinjha, RK Identification of a novel series of BET family bromodomain inhibitors: binding mode and profile of I-BET151 (GSK1210151A). Bioorg Med Chem Lett22:2968-72 (2012) 
 
Cytochrome P450 3A4
Name:Cytochrome P450 3A4
Type:Enzyme
Mol. Mass.:57349.57
Organism:Homo sapiens (Human)
Description:n/a
Residue:503
BDBM50380682
NameBDBM50380682
Synonyms:CHEMBL2017291 | I-BET151 (16)
TypeSmall organic molecule
Emp. Form.C23H21N5O3
Mol. Mass.415.4445
SMILESCOc1cc2c3n([C@H](C)c4ccccn4)c(=O)[nH]c3cnc2cc1-c1c(C)noc1C