Reaction Details
TargetDual specificity calcium/calmodulin-dependent 3',5'-cyclic nucleotide phosphodiesterase 1C
LigandBDBM50397838
Substrate/Competitorn/a
Meas. Tech.ChEMBL_876338 (CHEMBL2185812)
IC50 1394±n/a nM
Citation Verhoest, PRFonseca, KRHou, XProulx-Lafrance, CCorman, MHelal, CJClaffey, MMTuttle, JBCoffman, KJLiu, SNelson, FKleiman, RJMenniti, FSSchmidt, CJVanase-Frawley, MLiras, S Design and discovery of 6-[(3S,4S)-4-methyl-1-(pyrimidin-2-ylmethyl)pyrrolidin-3-yl]-1-(tetrahydro-2H-pyran-4-yl)-1,5-dihydro-4H-pyrazolo[3,4-d]pyrimidin-4-one (PF-04447943), a selective brain penetrant PDE9A inhibitor for the treatment of cognitive disorders. J Med Chem55:9045-54 (2012) 
 
Dual specificity calcium/calmodulin-dependent 3',5'-cyclic nucleotide phosphodiesterase 1C
Name:Dual specificity calcium/calmodulin-dependent 3',5'-cyclic nucleotide phosphodiesterase 1C
Type:Enzyme
Mol. Mass.:80778.58
Organism:Homo sapiens (Human)
Description:Q14123
Residue:709
BDBM50397838
NameBDBM50397838
Synonyms:CHEMBL2179105 US10513524, Reference compound disclosed in WO2008/139293 | US11608342, Reference compound disclosed in WO2008/139293
TypeSmall organic molecule
Emp. Form.C20H25N7O2
Mol. Mass.395.4582
SMILESC[C@@H]1CN(Cc2ncccn2)C[C@H]1c1nc2n(ncc2c(=O)[nH]1)C1CCOCC1