Reaction Details
TargetRAC-gamma serine/threonine-protein kinase
LigandBDBM50398368
Substrate/Competitorn/a
Meas. Tech.ChEMBL_875914 (CHEMBL2188027)
IC50 5±n/a nM
Citation Blake, JFXu, RBencsik, JRXiao, DKallan, NCSchlachter, SMitchell, ISSpencer, KLBanka, ALWallace, EMGloor, SLMartinson, MWoessner, RDVigers, GPBrandhuber, BJLiang, JSafina, BSLi, JZhang, BChabot, CDo, SLee, LOeh, JSampath, DLee, BBLin, KLiederer, BMSkelton, NJ Discovery and preclinical pharmacology of a selective ATP-competitive Akt inhibitor (GDC-0068) for the treatment of human tumors. J Med Chem55:8110-27 (2012) 
 
RAC-gamma serine/threonine-protein kinase
Name:RAC-gamma serine/threonine-protein kinase
Type:Enzyme
Mol. Mass.:55769.36
Organism:Homo sapiens (Human)
Description:n/a
Residue:479
BDBM50398368
NameBDBM50398368
Synonyms:CHEMBL2177379
TypeSmall organic molecule
Emp. Form.C24H30ClN5O2
Mol. Mass.455.98
SMILESC[C@@H]1C[C@@H](O)c2ncnc(N3CCN(CC3)C(=O)[C@H]([C@@H]3CCCN3)c3ccc(Cl)cc3)c12