Reaction Details
TargetDihydrofolate reductase
LigandBDBM50398392
Substrate/Competitorn/a
Meas. Tech.ChEMBL_876347 (CHEMBL2185821)
Ki 4680±n/a nM
Citation Corona, PGibellini, FCavalli, ASaxena, PCarta, ALoriga, MLuciani, RPaglietti, GGuerrieri, DNerini, EGupta, SHannaert, VMichels, PAFerrari, SCosti, PM Structure-based selectivity optimization of piperidine-pteridine derivatives as potent Leishmania pteridine reductase inhibitors. J Med Chem55:8318-29 (2012) 
 
Dihydrofolate reductase
Name:Dihydrofolate reductase
Type:Enzyme
Mol. Mass.:21453.99
Organism:Homo sapiens (Human)
Description:Recombinant human DHFR.
Residue:187
BDBM50398392
NameBDBM50398392
Synonyms:CHEMBL2178603
TypeSmall organic molecule
Emp. Form.C23H28N8O3
Mol. Mass.464.5202
SMILESCCc1ccc(NCc2cnc3nc(N)nc(N)c3n2)cc1C(=O)N1CCC(CC1)C(=O)OC