Reaction Details
TargetMitogen-activated protein kinase 14
LigandBDBM50398461
Substrate/Competitorn/a
Meas. Tech.ChEMBL_872749 (CHEMBL2185574)
IC50 290±n/a nM
Citation Selig, RGoettert, MSchattel, VSchollmeyer, DAlbrecht, WLaufer, S A frozen analogue approach to aminopyridinylimidazoles leading to novel and promising p38 MAP kinase inhibitors. J Med Chem55:8429-39 (2012) 
 
Mitogen-activated protein kinase 14
Name:Mitogen-activated protein kinase 14
Type:Serine/threonine-protein kinase
Mol. Mass.:41286.76
Organism:Homo sapiens (Human)
Description:Q16539
Residue:360
BDBM50398461
NameBDBM50398461
Synonyms:CHEMBL2179120
TypeSmall organic molecule
Emp. Form.C31H25FN4O3
Mol. Mass.520.5536
SMILESCOc1cc(cc(OC)c1OC)-c1nc(c([nH]1)-c1ccc(F)cc1)-c1ccnc2[nH]c(cc12)-c1ccccc1