Reaction Details
TargetHigh affinity cGMP-specific 3',5'-cyclic phosphodiesterase 9A
LigandBDBM50398649
Substrate/Competitorn/a
Meas. Tech.ChEMBL_874730 (CHEMBL2187963)
IC50 21±n/a nM
Citation Meng, FHou, JShao, YXWu, PYHuang, MZhu, XCai, YLi, ZXu, JLiu, PLuo, HBWan, YKe, H Structure-based discovery of highly selective phosphodiesterase-9A inhibitors and implications for inhibitor design. J Med Chem55:8549-58 (2012) 
 
High affinity cGMP-specific 3',5'-cyclic phosphodiesterase 9A
Name:High affinity cGMP-specific 3',5'-cyclic phosphodiesterase 9A
Type:Protein
Mol. Mass.:68488.40
Organism:Homo sapiens (Human)
Description:O76083
Residue:593
BDBM50398649
NameBDBM50398649
Synonyms:CHEMBL2178115 | US9617269, Compound WYQ-94-D
TypeSmall organic molecule
Emp. Form.C21H19ClN6O3
Mol. Mass.438.867
SMILESCOc1ccc(NC(=O)C(C)Nc2nc3n(ncc3c(=O)[nH]2)-c2ccccc2Cl)cc1