Reaction Details
TargetBeta-secretase 1
LigandBDBM50398884
Substrate/Competitorn/a
Meas. Tech.ChEMBL_873596 (CHEMBL2187885)
IC50 630±n/a nM
Citation Gerritz, SWZhai, WShi, SZhu, SToyn, JHMeredith, JEIben, LGBurton, CRAlbright, CFGood, ACTebben, AJMuckelbauer, JKCamac, DMMetzler, WCook, LSPadmanabha, RLentz, KASofia, MJPoss, MAMacor, JEThompson, LA Acyl guanidine inhibitors ofß-secretase (BACE-1): optimization of a micromolar hit to a nanomolar lead via iterative solid- and solution-phase library synthesis. J Med Chem55:9208-23 (2012) 
 
Beta-secretase 1
Name:Beta-secretase 1
Type:Protein
Mol. Mass.:55755.10
Organism:Homo sapiens (Human)
Description:P56817
Residue:501
BDBM50398884
NameBDBM50398884
Synonyms:CHEMBL2178178
TypeSmall organic molecule
Emp. Form.C20H19Cl2N5O2S
Mol. Mass.464.368
SMILESCOc1ccc(cc1)-c1nsc(C)c1C(=O)NC(N)=NCc1cc(Cl)c(N)c(Cl)c1