Reaction Details
TargetBeta-secretase 1
LigandBDBM50398880
Substrate/Competitorn/a
Meas. Tech.ChEMBL_873596 (CHEMBL2187885)
IC50 780±n/a nM
Citation Gerritz, SWZhai, WShi, SZhu, SToyn, JHMeredith, JEIben, LGBurton, CRAlbright, CFGood, ACTebben, AJMuckelbauer, JKCamac, DMMetzler, WCook, LSPadmanabha, RLentz, KASofia, MJPoss, MAMacor, JEThompson, LA Acyl guanidine inhibitors ofß-secretase (BACE-1): optimization of a micromolar hit to a nanomolar lead via iterative solid- and solution-phase library synthesis. J Med Chem55:9208-23 (2012) 
 
Beta-secretase 1
Name:Beta-secretase 1
Type:Protein
Mol. Mass.:55755.10
Organism:Homo sapiens (Human)
Description:P56817
Residue:501
BDBM50398880
NameBDBM50398880
Synonyms:CHEMBL2178183
TypeSmall organic molecule
Emp. Form.C24H26ClN5O4
Mol. Mass.483.947
SMILESCCC(=O)Nc1c(C)cc(CN=C(N)NC(=O)c2c(C)onc2-c2ccc(OC)cc2)cc1Cl