Reaction Details
TargetBeta-secretase 1
LigandBDBM50398906
Substrate/Competitorn/a
Meas. Tech.ChEMBL_873597 (CHEMBL2187886)
Ki 910±n/a nM
Citation Gerritz, SWZhai, WShi, SZhu, SToyn, JHMeredith, JEIben, LGBurton, CRAlbright, CFGood, ACTebben, AJMuckelbauer, JKCamac, DMMetzler, WCook, LSPadmanabha, RLentz, KASofia, MJPoss, MAMacor, JEThompson, LA Acyl guanidine inhibitors ofß-secretase (BACE-1): optimization of a micromolar hit to a nanomolar lead via iterative solid- and solution-phase library synthesis. J Med Chem55:9208-23 (2012) 
 
Beta-secretase 1
Name:Beta-secretase 1
Type:Protein
Mol. Mass.:55755.10
Organism:Homo sapiens (Human)
Description:P56817
Residue:501
BDBM50398906
NameBDBM50398906
Synonyms:CHEMBL2178197
TypeSmall organic molecule
Emp. Form.C20H18Cl2N4O3
Mol. Mass.433.288
SMILESCOc1ccc(cc1)-c1noc(C)c1C(=O)NC(N)=NCc1ccc(Cl)c(Cl)c1