Reaction Details
Target5-hydroxytryptamine receptor 2A
LigandBDBM50398963
Substrate/Competitorn/a
Meas. Tech.ChEMBL_875037 (CHEMBL2184355)
Ki>10000±n/a nM
Citation Furlotti, GAlisi, MAApicella, CCapezzone de Joannon, ACazzolla, NCosti, RCuzzucoli Crucitti, GGarrone, BIacovo, AMagarò, GMangano, GMiele, GOmbrato, RPescatori, LPolenzani, LRosi, FVitiello, MDi Santo, R Discovery and pharmacological profile of new 1H-indazole-3-carboxamide and 2H-pyrrolo[3,4-c]quinoline derivatives as selective serotonin 4 receptor ligands. J Med Chem55:9446-66 (2012) 
 
5-hydroxytryptamine receptor 2A
Name:5-hydroxytryptamine receptor 2A
Type:undefined
Mol. Mass.:52607.65
Organism:Homo sapiens (Human)
Description:P28223
Residue:471
BDBM50398963
NameBDBM50398963
Synonyms:CHEMBL2179674
TypeSmall organic molecule
Emp. Form.C27H29N3O3
Mol. Mass.443.5375
SMILESCn1cc2c(OCC3CCN(CCc4ccc(cc4)C(O)=O)CC3)nc3ccccc3c2c1