Reaction Details
Target5-hydroxytryptamine receptor 4
LigandBDBM50398974
Substrate/Competitorn/a
Meas. Tech.ChEMBL_875039 (CHEMBL2184357)
Ki 398.11±n/a nM
Citation Furlotti, GAlisi, MAApicella, CCapezzone de Joannon, ACazzolla, NCosti, RCuzzucoli Crucitti, GGarrone, BIacovo, AMagarò, GMangano, GMiele, GOmbrato, RPescatori, LPolenzani, LRosi, FVitiello, MDi Santo, R Discovery and pharmacological profile of new 1H-indazole-3-carboxamide and 2H-pyrrolo[3,4-c]quinoline derivatives as selective serotonin 4 receptor ligands. J Med Chem55:9446-66 (2012) 
 
5-hydroxytryptamine receptor 4
Name:5-hydroxytryptamine receptor 4
Type:Enzyme
Mol. Mass.:43767.54
Organism:Homo sapiens (Human)
Description:Q13639
Residue:388
BDBM50398974
NameBDBM50398974
Synonyms:CHEMBL2179680
TypeSmall organic molecule
Emp. Form.C18H21N3O
Mol. Mass.295.3788
SMILESCn1cc2c(OCC3CCNCC3)nc3ccccc3c2c1