Reaction Details
Target5-hydroxytryptamine receptor 2A
LigandBDBM50398980
Substrate/Competitorn/a
Meas. Tech.ChEMBL_875037 (CHEMBL2184355)
Ki>1000±n/a nM
Citation Furlotti, GAlisi, MAApicella, CCapezzone de Joannon, ACazzolla, NCosti, RCuzzucoli Crucitti, GGarrone, BIacovo, AMagarò, GMangano, GMiele, GOmbrato, RPescatori, LPolenzani, LRosi, FVitiello, MDi Santo, R Discovery and pharmacological profile of new 1H-indazole-3-carboxamide and 2H-pyrrolo[3,4-c]quinoline derivatives as selective serotonin 4 receptor ligands. J Med Chem55:9446-66 (2012) 
 
5-hydroxytryptamine receptor 2A
Name:5-hydroxytryptamine receptor 2A
Type:undefined
Mol. Mass.:52607.65
Organism:Homo sapiens (Human)
Description:P28223
Residue:471
BDBM50398980
NameBDBM50398980
Synonyms:CHEMBL2179700
TypeSmall organic molecule
Emp. Form.C23H35N5O2
Mol. Mass.413.5563
SMILESCC(C)n1nc(C(=O)NCC2CCN(CCN3CCOCC3)CC2)c2ccccc12