Reaction Details
TargetSphingosine 1-phosphate receptor 5
LigandBDBM50399039
Substrate/Competitorn/a
Meas. Tech.ChEMBL_874561 (CHEMBL2186197)
EC50>10000±n/a nM
Citation Angst, DJanser, PQuancard, JBuehlmayer, PBerst, FOberer, LBeerli, CStreiff, MPally, CHersperger, RBruns, CBassilana, FBollbuck, B An oral sphingosine 1-phosphate receptor 1 (S1P(1)) antagonist prodrug with efficacy in vivo: discovery, synthesis, and evaluation. J Med Chem55:9722-34 (2012) 
 
Sphingosine 1-phosphate receptor 5
Name:Sphingosine 1-phosphate receptor 5
Type:G Protein-Coupled Receptor (GPCR)
Mol. Mass.:41796.42
Organism:Homo sapiens (Human)
Description:n/a
Residue:398
BDBM50399039
NameBDBM50399039
Synonyms:CHEMBL2178814
TypeSmall organic molecule
Emp. Form.C30H36ClN3O5S
Mol. Mass.586.142
SMILESCN(C)CC[C@H](N(C)C(=O)c1c(C)cc(cc1C)-c1cccc(NS(=O)(=O)c2cc(C)c(Cl)cc2C)c1)C(O)=O