Reaction Details
Target11-beta-hydroxysteroid dehydrogenase 1
LigandBDBM50399352
Substrate/Competitorn/a
Meas. Tech.ChEMBL_877632 (CHEMBL2184996)
IC50 6±n/a nM
Citation Scott, JSdeSchoolmeester, JKilgour, EMayers, RMPacker, MJHargreaves, DGerhardt, SOgg, DJRees, ASelmi, NStocker, ASwales, JGWhittamore, PR Novel acidic 11ß-hydroxysteroid dehydrogenase type 1 (11ß-HSD1) inhibitor with reduced acyl glucuronide liability: the discovery of 4-[4-(2-adamantylcarbamoyl)-5-tert-butyl-pyrazol-1-yl]benzoic acid (AZD8329). J Med Chem55:10136-47 (2012) 
 
11-beta-hydroxysteroid dehydrogenase 1
Name:11-beta-hydroxysteroid dehydrogenase 1
Type:Enzyme
Mol. Mass.:32409.16
Organism:Homo sapiens (Human)
Description:P28845
Residue:292
BDBM50399352
NameBDBM50399352
Synonyms:CHEMBL2177616
TypeSmall organic molecule
Emp. Form.C24H29N3O4S
Mol. Mass.455.57
SMILESCCCSc1c(cnn1-c1ccc(cc1)C(O)=O)C(=O)N[C@H]1C2CC3CC1C[C@](O)(C3)C2