Reaction Details
TargetCannabinoid receptor 2
LigandBDBM50399526
Substrate/Competitorn/a
Meas. Tech.ChEMBL_878264 (CHEMBL2185469)
Ki>20000±n/a nM
Citation Fulp, ABortoff, KZhang, YSeltzman, HMathews, JSnyder, RFennell, TMaitra, R Diphenyl purine derivatives as peripherally selective cannabinoid receptor 1 antagonists. J Med Chem55:10022-32 (2012) 
 
Cannabinoid receptor 2
Name:Cannabinoid receptor 2
Type:G Protein-Coupled Receptor (GPCR)
Mol. Mass.:39690.94
Organism:Homo sapiens (Human)
Description:P34972
Residue:360
BDBM50399526
NameBDBM50399526
Synonyms:CHEMBL2180223
TypeSmall organic molecule
Emp. Form.C33H33Cl2N7O
Mol. Mass.614.567
SMILESCCCCNC(=O)NC1(CCN(CC1)c1ncnc2n(c(nc12)-c1ccccc1Cl)-c1ccc(Cl)cc1)c1ccccc1